{"text_format":"1","workbook":"xlsx","n_sheets":3,"sheets":["INSTRUÇÕES","Inquérito de Caracterização","--"],"not_rendered":{"charts":0,"images":4,"macros":1,"external_links":0,"defined_names":0,"comments":0,"pivot_tables":0},"unopened":[],"bounds":{"document_bytes":16777216,"sheet_cells":100000,"rows_first":2000,"rows_last":500,"rows_between":2000,"halvings":0,"cell_chars":16384,"cell_head_chars":4096},"cells_cut":0,"cells_raw":0,"read":"whole","date_system":"1900"}

{"sheet":"INSTRUÇÕES","index":0,"n_rows":20,"n_cols":4,"rows_kept":20,"cut":false,"hidden":false,"merged":[[19,1,19,4],[0,1,0,7],[1,1,1,7],[2,1,2,7],[12,1,12,7],[4,1,4,7],[3,1,3,7],[5,1,5,7],[9,3,9,7],[7,3,8,7],[13,1,14,7],[15,1,15,7],[16,1,16,7],[17,1,17,7],[10,1,11,7]]}
[null,"Colégio de Pediatria da Ordem dos Médicos"]
[null,"Inquérito de Caracterização dos Serviços de Pediatria para atribuição de idoneidade formativa"]
[null,{"$f":"\"Ano \"&'--'!D17","v":"Ano 2020"}]
[null,"Caro(a) colega"]
[null,"Este ano enviamos um novo formato de ficheiro para recolha dos dados de caracterização dos Serviços de Pediatria para atribuição de Idoneidade Formativa. Antes de iniciar o preenchimento, por favor leia todas as instruções desta página. "]
[null,"Só serão analisados os inquéritos enviados no corrente formato, não sendo aceites respostas em outros formatos, nomeadamente os utilizados em anos anteriores."]
[null,"Para o  preenchimento do mesmo apenas terá que adicionar a informação solicitada em dois tipos de células que mudam de cor assim que preenchidas:"]
[null,"Células de cor LARANJA",null,"Escolher opção da lista disponível. Quando selecionar a célula, surgirá à direita um botão com um triangulo preto, que ao \"clicar\" abrirá o menu de escolha das opções."]
[]
[null,"Células de cor CINZENTA",null,"Introduzir informação numérica ou texto solicitada"]
[null,"Só deve introduzir a informação relevante. Quando não houver informação para o item pretendido, deve deixar a célula em branco, sem dados introduzidos. Os dados estatísticos solicitados dizem respeito aos dois últimos anos de atividade assistencial/científica. Caso não consiga obter os dados para o total do ano indique na célula respetiva o valor apurado e em notas indique o período a que se referem os dados introduzidos."]
[]
[null,"Por razões de segurança e análise dos dados enviados, deverão ser enviados dois ficheiros, um em formato PDF (ACROBAT) e outro em formato XLS ou XLSX (EXCEL)."]
[null,"Antes de iniciar o preenchimento deverá Ativar o Conteúdo (barra amarela em cima). Em algumas versões de Excel pode ser necessário activar os Macros (surgirá informação na barra acima; selecionar opções e \"habilitar o conteúdo\"). Isso é essencial para que o preenchimento decorra normalmente."]
[]
[null,"DEVERÁ GRAVAR ESTE FICHEIRO NO AMBIENTE DE TRABALHO com o nome do seu hospital após o título atual (ex: Inquérito de avaliação idoneidade_CHSJoão) antes de iniciar o preenchimento do mesmo. No final do preenchimento clique no ícone com o desenho de uma disquete. Será automaticamente criado um ficheiro PDF no Ambiente de Trabalho do seu computador com o mesmo nome."]
[null,"Após o preenchimento, os 2 ficheiros do inquérito (pdf e xls) e respectivos anexos, devem ser enviados via Internato Médico do seu hospital para o CRIM respetivo, como vinha sendo hábito nos anos anteriores. Por segurança sugerimos que peça confirmação de recepção ou \"recibo eletrónico\" de entrega da mensagem."]
[null,"Ao enviar o PDF (ACROBAT) gerado para o email (Internato Médico do Hospital e/ou CRIM), é considerado que a resposta ao inquérito se encontra validada pelo Diretor do Serviço na data e hora inscrita no ficheiro."]
[]
[null,"Clique aqui para iniciar o preenchimento"]

{"sheet":"Inquérito de Caracterização","index":1,"n_rows":271,"n_cols":15,"rows_kept":271,"cut":false,"hidden":false,"merged":[[235,2,235,4],[263,1,263,8],[264,1,264,8],[266,1,266,8],[265,1,265,8],[238,5,238,7],[238,2,238,4],[258,1,258,8],[244,1,244,8],[254,1,254,8],[255,1,255,8],[233,5,233,7],[180,1,180,8],[214,1,214,8],[236,2,236,4],[237,2,237,4],[223,2,223,4],[224,2,224,4],[226,2,226,4],[227,2,227,4],[225,2,225,4],[235,5,235,7],[236,5,236,7],[237,5,237,7],[234,5,234,7],[222,2,222,4],[233,2,233,4],[234,2,234,4],[109,3,109,6],[103,1,103,8],[182,3,183,3],[182,4,183,4],[182,5,183,5],[182,6,183,6],[181,5,181,6],[105,3,105,6],[106,3,106,6],[107,3,107,6],[108,3,108,6],[119,1,119,8],[112,2,113,6],[164,1,164,8],[181,7,182,8],[96,1,96,2],[86,1,86,2],[141,1,141,8],[148,1,148,8],[154,1,154,8],[86,3,86,8],[111,3,111,6],[140,1,140,8],[120,1,121,1],[129,3,129,6],[110,3,110,6],[175,1,175,8],[181,3,181,4],[155,4,155,5],[155,2,155,3],[170,1,170,8],[80,3,80,7],[96,3,96,7],[3,1,3,7],[16,2,16,6],[36,2,37,2],[79,1,79,2],[36,3,37,3],[36,4,36,6],[29,5,30,6],[4,7,4,8],[10,2,10,8],[11,2,11,8],[12,2,12,8],[15,1,15,8],[81,3,85,8],[91,3,91,8],[0,1,0,8],[1,1,1,8],[2,1,2,8],[24,1,24,7],[66,1,66,2],[35,1,35,8],[26,1,26,8],[65,1,65,8]]}
[null,"Colégio de Pediatria da Ordem dos Médicos"]
[null,"Inquérito de Caracterização dos Serviços de Pediatria para atribuição de idoneidade formativa"]
[null,{"$f":"\"Ano \"&'--'!$D$17","v":"Ano 2020"}]
[null,"Preencher apenas as células côr de LARANJA (opções) e CINZENTA (números/texto)"]
[null,null,null,null,null,null,null,{"$f":"NOW()","v":"2019-01-16T17:15:22.770"}]
[null,"Região de Saúde"]
[]
[null,"Centro Hospitalar / Unidade Local de Saúde",{"$f":"IF($B$9=\"outro\",\"Por favor introduza na celula abaixo o nome do seu hospital\",\"\")","v":""}]
[null,null,null,null,null,null,null,{"$f":"IF(B9=\"\",\"\",VLOOKUP(B9,'--'!G3:H42,2,))","v":""}]
[null,"Serviço de Pediatria"]
[null,"Diretor(a) do Serviço"]
[null,"Correio eletrónico/email"]
[null,"Telefone"]
[]
[]
[null,"1. Médicos colocados no Serviço e com trabalho efetivo na instituição"]
[null,{"$f":"\"Dados relativos a 2 de dezembro de \"&('--'!D17-2)","v":"Dados relativos a 2 de dezembro de 2018"},"Horário semanal"]
[null,null,"42 h","40 h","35 h","20 h","Outro",null,"Total",null,null,null,"S/N","Triagem","Unidade"]
[null,"Nº Assistentes Hospitalares Graduados Sénior de Pediatria",null,null,null,null,null,null,{"$f":"SUM(C19:G19)","v":0},null,null,null,"Sim","Não"]
[null,"Nº Assistentes Hospitalares Graduados de Pediatria",null,null,null,null,null,null,{"$f":"SUM(C20:G20)","v":0},null,null,null,"Não","Manchester","Não"]
[null,"Nº Assistentes Hospitalares de Pediatria",null,null,null,null,null,null,{"$f":"SUM(C21:G21)","v":0},null,null,null,null,"Canadiana","Intensivos"]
[null,"Nº Especialistas em Contrato de Prestação de Serviços",null,null,null,null,null,null,{"$f":"SUM(C22:G22)","v":0},null,null,null,null,"Outra","Intermedios"]
[null,"Total",{"$f":"SUM(C19:C22)","v":0},{"$f":"SUM(D19:D22)","v":0},0,0,0,null,{"$f":"SUM(I19:I22)","v":0}]
[null,"Nº Internos de Formação Especifica em Pediatria da própria instituição",null,null,null,null,null,null,{"$f":"SUM(C24:G24)","v":0}]
[null,{"$f":"\"Contabilizar todos os internos do Serviço a 2 de dezembro de  \"&('--'!D17-2)&\", mesmo os que estão em outras instituições a fazer estágios.\"","v":"Contabilizar todos os internos do Serviço a 2 de dezembro de  2018, mesmo os que estão em outras instituições a fazer estágios."}]
[]
[null,"1.1 Internos de Formação Especifica em Pediatria (IFEP)"]
[null,{"$f":"'--'!D17-2","v":2018},"Da própria instituição",null,"De outra instituição",null,null,null,"Total"]
[null,"1º ano",null,null,null,null,null,null,{"$f":"SUM(C29:G29)","v":0}]
[null,"2º ano",null,null,null,"Em presença efetiva no Serviço",null,null,{"$f":"SUM(C30:G30)","v":0}]
[null,"3º ano",null,null,null,null,null,null,{"$f":"SUM(C31:G31)","v":0}]
[null,"4º ano",null,null,null,null,null,null,{"$f":"SUM(C32:G32)","v":0}]
[null,"5º ano",null,null,null,null,null,null,{"$f":"SUM(C33:G33)","v":0}]
[null,"Total",{"$f":"SUM(C29:C33)","v":0},null,{"$f":"SUM(E29:E33)","v":0},null,null,null,{"$f":"SUM(I29:I33)","v":0}]
[]
[null,"2. Estágios pretendidos e idoneidades para IFEP"]
[null,null,{"$f":"\"Número máximo de internos em Simultâneo por Estágio que tiveram em \"&'--'!D17-2","v":"Número máximo de internos em Simultâneo por Estágio que tiveram em 2018"},{"$f":"\"Número máximo de internos em Simultâneo por Estágio pretendidos para \"&'--'!D17-1","v":"Número máximo de internos em Simultâneo por Estágio pretendidos para 2019"},"Caracterização da Área"]
[null,null,null,null,"Número de Médicos com Dedicação à Área","Número de Médicos com Sub-especialidade/Ciclo de Estudos Especiais/Equivalência a CEE na Área","Número de Horas de Consulta Semanal da Área",null,{"$f":"\"Variação \"&('--'!D17-1)&\" - \"&('--'!D17-2)","v":"Variação 2019 - 2018"}]
[null,"Pediatria Geral 1 da própria instituição (13m)",null,null,null,null,null,null,{"$f":"D39-C39","v":0}]
[null,"Pediatria Geral 2 da própria instituição (12m)",null,null,null,null,null,null,0]
[null,"Pediatria Geral 2 de outra instituição (12m)",null,null,null,null,null,null,0]
[null,"Bloco de Partos e Cuidados Perinatais (3 m)",null,null,null,null,null,null,0]
[null,"Alergologia Pediátrica (3m)",null,null,null,null,null,null,0]
[null,"Cardiologia Pediátrica (3m)",null,null,null,null,null,null,0]
[null,"Cirurgia Pediátrica (1m)",null,null,null,null,null,null,0]
[null,"Cuidados Intensivos Neonatais (3m)",null,null,null,null,null,null,0]
[null,"Cuidados Intensivos Pediatricos (3m)",null,null,null,null,null,null,0]
[null,"Dermatologia Pediátrica (3m)",null,null,null,null,null,null,0]
[null,"Doenças Hereditárias do Metabolismo (3m)",null,null,null,null,null,null,0]
[null,"Endocrinologia Pediátrica (3m)",null,null,null,null,null,null,0]
[null,"Gastrenterologia e Hepatologia Pediátrica (3m)",null,null,null,null,null,null,0]
[null,"Genética (3m)",null,null,null,null,null,null,0]
[null,"Hematologia Pediátrica (3m)",null,null,null,null,null,null,0]
[null,"Medicina do Adolescente (3m)",null,null,null,null,null,null,0]
[null,"Nefrologia Pediátrica (3m)",null,null,null,null,null,null,0]
[null,"Neurodesenvolvimento (3m)",null,null,null,null,null,null,0]
[null,"Neuropediatria (3m)",null,null,null,null,null,null,0]
[null,"Oftalmologia Pediátrica (3m)",null,null,null,null,null,null,0]
[null,"Oncologia Pediátrica (3m)",null,null,null,null,null,null,0]
[null,"Ortopedia Pediatrica (1m)",null,null,null,null,null,null,0]
[null,"Otorrinolaringologia Pediátrica (3m)",null,null,null,null,null,null,0]
[null,"Pedopsiquiatria (3m)",null,null,null,null,null,null,0]
[null,"Pneumologia Pediátrica e Sono (3m)",null,null,null,null,null,null,0]
[]
[]
[null,"3. Instalações e apoios complementares"]
[null,"3.1 Internamento",null,"3.5 Disponibilidade de MCDTs",null,null,null,null,"7x365 d ?"]
[null,"Número total de camas de internamento de Pediatria Médica",null,null,null,null,"Patologia clínica"]
[null,"Número de camas em quartos individuais",null,null,null,null,"Imunohemoterapia"]
[null,"Quarto para isolamento",null,null,null,null,"Radiologia convencional"]
[null,"Unidade de adolescentes individualizada",null,null,null,null,"Ecografia"]
[null,"Número de camas para adolescentes",null,null,null,null,"TAC"]
[null,"Sala para procedimentos técnicos",null,null,null,null,"Acesso a RMN"]
[null,"Sala de atividades lúdicas",null,"3.6 Apoio de outras especialidades",null,null,null,null,"24 h ?"]
[null,"Salas de atividades lúdicas separadas por grupos etários",null,null,null,null,"Cirurgia"]
[null,"Gabinete de acolhimento aos pais",null,null,null,null,"Ortopedia"]
[null,"Sala de trabalho para internos",null,null,null,null,"Obstetrícia"]
[null,"Sala de reuniões",null,null,null,null,"Anestesia"]
[null,"Número de gabinetes para os médicos do Serviço",null,null,null,null,"Neurologia"]
[null,"3.2 Consulta Externa",null,null,null,null,"Psiquiatria/Pedopsiquiatria"]
[null,"Idade limite dos doentes admitidos na Consulta Pediatrica",null,"Apoios de outras especialidades:"]
[null,"Número total de gabinetes de consulta"]
[null,"Área especifica para a Pediatria"]
[null,"Sala de espera exclusiva da Pediatria"]
[null,"Sala de preparação de consulta (enfermagem)"]
[null,"Sala de colheitas exclusiva de Pediatria"]
[null,"3.3 Urgência",null,"3.7 Outros"]
[null,"Urgência Pediátrica individualizada dos adultos",null,null,null,null,"NHACJR em funcionamento"]
[null,"Idade limite dos doentes admitidos na Urgência Pediátrica",null,null,null,null,"Colaboração com a ELI / SNIPI"]
[null,"Sala de espera exclusiva da Pediatria",null,null,null,null,"Reuniões regulares UCF"]
[null,"Sala de triagem própria",null,null,null,null,"Periodicidade (por ano)"]
[null,"Sistema de Triagem",null,"3.8 Sistemas de informação"]
[null,"Número de gabinetes individuais de atendimento médico",null,null,null,null,"Processo clínico informatizado"]
[null,"Sala de colheitas exclusiva de Pediatria",null,null,null,null,"Acesso ao RME (ex PDS)"]
[null,"UICD/SO"]
[null,"Número de camas UICD/SO"]
[null,"3.4 Hospital de Dia"]
[null,"O Serviço tem Hospital de Dia pediátrico"]
[null,"Funciona em espaço fisicamente separado dos adultos"]
[null,"Número de camas/unidades disponíveis"]
[null,"Tem pessoal enfermagem dedicado a esta área"]
[null,"Tem pessoal médico dedicado a esta área"]
[]
[null,"4. Serviço de Urgência Pediatria Geral - recursos médicos"]
[null,null,null,"Obs"]
[null,"Total de horas da equipa tipo de urgência por dia"]
[null,"Horas em presença física (PF) por dia"]
[null,"Horas em prevenção por dia"]
[null,"Horas da equipa tipo asseguradas exclusivamente por Pediatras"]
[null,"Horas da equipa tipo asseguradas por Internos"]
[null,"Número de Pediatras (especialistas em PF) durante o dia (8:00-20:00)"]
[null,"Número de Pediatras (especialistas PF) durante a noite (20:00-8:00)"]
[null,"Observações / comentários"]
[]
[null,"Programa de formação / reciclagem em Suporte Avançado / Imediato de Vida Pediátrico:"]
[null,"para Internos Formação Específica"]
[null,"para Médicos Especialistas"]
[null,"para Enfermeiros"]
[]
[null,"5. Neonatologia"]
[null,null,"Intensivos","Intermédios"]
[null,null,null,null,"(Sim/Não)"]
[null,"Nº de camas"]
[null,"Idade de gestação minima recomendada / definida para admissão",null,null,"semanas"]
[null,"Nº de horas de equipa tipo exclusiva por dia para cada unidade"]
[]
[null,"Equipa Médica individualizada exclusiva para apoio neonatal nas 24 h"]
[null,"Pediatra / Neonatologista em todos os partos"]
[null,null,null,null,null,null,"Rastreio Auditivo Neonatal Universal"]
[null,"Programa de formação / reciclagem em reanimação neonatal:",null,"Rastreio de Cardiopatia Congénita"]
[null,"Médicos",null,null,null,null,"Acreditação \"Hospital Amigo dos Bébés\""]
[null,"Enfermeiros",null,null,null,null,"Preenchimento da Notícia de Nascimento"]
[]
[]
[null,"5. Cuidados Intensivos Pediátricos"]
[null,"Número de camas"]
[null,"Nº de horas de equipa tipo exclusiva por dia"]
[null,"Número de Pediatras (especialistas) durante o dia (8:00-20:00)"]
[null,"Número de Pediatras (especialistas) durante a noite (20:00-8:00)"]
[]
[null,"6. Indicadores de movimento assistencial"]
[null,"6.1 Internamento de Pediatria Médica"]
[null,null,{"$f":"'--'!D17-3","v":2017},null,{"$f":"'--'!D17-2","v":2018},null,null,null,"Variação"]
[null,"Número total de internamentos",null,null,null,null,null,null,{"$f":"E144-C144","v":0}]
[null,"Taxa de ocupação (%)",null,null,null,null,null,null,{"$f":"E145-C145","v":0}]
[null,"Demora média (dias)",null,null,null,null,null,null,0]
[null,"Número de internamentos de adolescentes (10 a 18 anos)",null,null,null,null,null,null,0]
[]
[null,"6.2 Urgência Pediátrica"]
[null,null,{"$f":"'--'!D17-3","v":2017},null,{"$f":"'--'!D17-2","v":2018},null,null,null,"Variação"]
[null,"Nº total de admissões na Urgência Pediátrica",null,null,null,null,null,null,{"$f":"E151-C151","v":0}]
[null,"% internados",null,null,null,null,null,null,{"$f":"E152-C152","v":0}]
[null,"Nº total de admissões de adolescentes na UP (10 a 18 anos)",null,{"$f":"C153/C151*100","v":{"$error":"#DIV/0!"}},null,{"$f":"E153/E151*100","v":{"$error":"#DIV/0!"}},null,null,0]
[]
[null,"6.3 Neonatologia e Cuidados Intensivos Neonatais"]
[null,null,{"$f":"'--'!D17-3","v":2017},null,{"$f":"'--'!D17-2","v":2018},null,null,null,"Variação"]
[null,null,"Intensivos","Intermédios","Intensivos","Intermédios"]
[null,"Número total de internamentos"]
[null,"Taxa de ocupação (%)"]
[null,"Demora média (dias)"]
[]
[null,"Número total de Partos",null,null,null,null,null,null,{"$f":"E162-C162","v":0}]
[null,"% cesarianas",null,null,null,null,null,null,{"$f":"E163-C163","v":0}]
[]
[null,"6.4 Cuidados Intensivos Pediátricos"]
[null,null,{"$f":"'--'!D17-3","v":2017},null,{"$f":"'--'!D17-2","v":2018},null,null,null,"Variação"]
[null,"Número total de internamentos",null,null,null,null,null,null,{"$f":"E167-C167","v":0}]
[null,"Taxa de ocupação (%)",null,null,null,null,null,null,0]
[null,"Demora média (dias)",null,null,null,null,null,null,0]
[]
[null,"6.5 Hospital de Dia"]
[null,null,{"$f":"'--'!D17-3","v":2017},null,{"$f":"'--'!D17-2","v":2018},null,null,null,"Variação"]
[null,"Número total de doentes admitidos",null,null,null,null,null,null,{"$f":"E173-C173","v":0}]
[null,"Número total de Sessões",null,null,null,null,null,null,0]
[]
[null,"6.6 UICD/SO"]
[null,null,{"$f":"'--'!D17-3","v":2017},null,{"$f":"'--'!D17-2","v":2018},null,null,null,"Variação"]
[null,"Número total de internamentos",null,null,null,null,null,null,{"$f":"E178-C178","v":0}]
[null,"Taxa de ocupação (%)",null,null,null,null,null,null,0]
[]
[null,"6.7 Consultas Externas"]
[null,null,null,{"$f":"'--'!D17-3","v":2017},null,{"$f":"'--'!D17-2","v":2018},null,"% de primeiras"]
[null,null,null,"Nº Primeiras","Nº Total","Nº Primeiras","Nº Total"]
[null,null,null,null,null,null,null,{"$f":"'--'!D17-3","v":2017},{"$f":"'--'!D17-2","v":2018}]
[null,"Consulta de Pediatria Geral",null,null,null,null,null,{"$f":"D185/E185*100","v":{"$error":"#DIV/0!"}},{"$f":"F185/G185*100","v":{"$error":"#DIV/0!"}}]
[null,"Consultas individualizadas","(Sim/Não)"]
[null,"Cardiologia Pediátrica",null,null,null,null,null,{"$f":"D187/E187*100","v":{"$error":"#DIV/0!"}},{"$f":"F187/G187*100","v":{"$error":"#DIV/0!"}}]
[null,"Dermatologia Pediátrica",null,null,null,null,null,{"$f":"D188/E188*100","v":{"$error":"#DIV/0!"}},{"$f":"F188/G188*100","v":{"$error":"#DIV/0!"}}]
[null,"Doenças Hereditárias do Metabolismo",null,null,null,null,null,{"$error":"#DIV/0!"},{"$error":"#DIV/0!"}]
[null,"Endocrinologia Pediátrica",null,null,null,null,null,{"$error":"#DIV/0!"},{"$error":"#DIV/0!"}]
[null,"Gastroenterologia Pediátrica",null,null,null,null,null,{"$error":"#DIV/0!"},{"$error":"#DIV/0!"}]
[null,"Genética",null,null,null,null,null,{"$error":"#DIV/0!"},{"$error":"#DIV/0!"}]
[null,"Hematologia Pediátrica",null,null,null,null,null,{"$error":"#DIV/0!"},{"$error":"#DIV/0!"}]
[null,"Imunoalergologia Pediátrica",null,null,null,null,null,{"$error":"#DIV/0!"},{"$error":"#DIV/0!"}]
[null,"Infecciologia Pediátrica",null,null,null,null,null,{"$error":"#DIV/0!"},{"$error":"#DIV/0!"}]
[null,"Medicina do Adolescente",null,null,null,null,null,{"$error":"#DIV/0!"},{"$error":"#DIV/0!"}]
[null,"Nefrologia Pediátrica",null,null,null,null,null,{"$error":"#DIV/0!"},{"$error":"#DIV/0!"}]
[null,"Neonatologia",null,null,null,null,null,{"$error":"#DIV/0!"},{"$error":"#DIV/0!"}]
[null,"Neurodesenvolvimento",null,null,null,null,null,{"$error":"#DIV/0!"},{"$error":"#DIV/0!"}]
[null,"Neuropediatria",null,null,null,null,null,{"$error":"#DIV/0!"},{"$error":"#DIV/0!"}]
{"$rows_left_out":72}
{"sheet":"--","index":2,"n_rows":269,"n_cols":10,"rows_kept":269,"cut":false,"hidden":false,"merged":[[17,2,23,4]]}
[]
[null,"Região Saúde",null,"S/N",null,null,"Hospital"]
[null,"ARS Norte",null,"Sim",null,null,"CH Baixo Vouga ","Aveiro",null,"Esta folha, foi propositadamente deixada em branco."]
[null,"ARS Centro",null,"Não",null,null,"CH Barreiro-Montijo","Barreiro"]
[null,"ARS Lisboa e Vale do Tejo",null,null,null,null,"CH de Setúbal","Setúbal",null,"Não é para ser preenchida."]
[null,"ARS Alentejo",null,"Sim, em horário exclusivo",null,null,"CH de Trás-os-Montes e Alto Douro","Vila Real"]
[null,"ARS Algarve",null,"Sim, dando apoio apenas",null,null,"CH de Vila Nova de Gaia/Espinho","VN Gaia"]
[null,"SRS RA Madeira",null,"Não",null,null,"CH do Médio Ave","VN Famalicão"]
[null,"SRS RA Açores",null,null,null,null,"CH do Médio Tejo","Torres Novas / Abrantes"]
[null,null,null,"Horário parcial",null,null,"CH do Oeste","Caldas da Rainha"]
[null,"Sistema Triagem",null,"24 h",null,null,"CH Entre Douro e Vouga","Feira"]
[null,"Não",null,"Não disponível",null,null,"CH Leiria","Leiria"]
[null,"Manchester",null,null,null,null,"CH Lisboa Ocidental","HS F Xavier"]
[null,"Canadiano",null,null,null,null,"CH Póvoa Varzim-Vila do Conde","Póvoa de Varzim"]
[null,"Outro",null,null,null,null,"CH Tâmega e Sousa","Penafiel"]
[null,null,null,"Ano do inquerito",null,null,"CH Tondela Viseu","Viseu"]
[null,null,null,2020,null,null,"CH Universitário Cova da Beira","Covilhã"]
[null,null,"Alterar esta célula, altera a data do inquerito e todas as opções relacionadas com a data. É a célula a alterar quando se fizer um inquerito para um novo ano",null,null,null,"CH Universitário de Coimbra","HP Coimbra"]
[null,null,null,null,null,null,"CH Universitário de Lisboa Central","HD Estefânia"]
[null,null,null,null,null,null,"CH Universitário de Lisboa Norte","HS Maria"]
[null,null,null,null,null,null,"CH Universitário de S. João","Porto"]
[null,null,null,null,null,null,"CH Universitário do Algarve","Faro"]
[null,null,null,null,null,null,"CH Universitário do Porto","CMIN"]
[null,null,null,null,null,null,"H de Cascais Dr José Almeida","Cascais"]
[null,null,null,null,null,null,"Hospital Beatriz Ângelo","Loures"]
[null,{"$f":"NOW()","v":"2019-01-16T17:15:22.770"},"Agora",null,null,null,"Hospital Central do Funchal","Funchal"]
[null,{"$f":"YEAR(B26)","v":2019},"Ano",null,null,null,"Hospital CUF Descobertas","Lisboa"]
[null,{"$f":"MONTH(B26)","v":1},"Mês",null,null,null,"Hospital da Senhora da Oliveira Guimarães","Guimarães"]
[null,{"$f":"DAY(B26)","v":16},"Dia",null,null,null,"Hospital de Braga","Braga"]
[null,{"$f":"HOUR(B26)","v":17},"Hora",null,null,null,"Hospital de Santarém","Santarém"]
[null,{"$f":"MINUTE(B26)","v":15},"Minuto",null,null,null,"Hospital de Vila Franca de Xira","V F Xira"]
[null,{"$f":"WEEKDAY(B26)","v":4},"Dia da semana",null,null,null,"Hospital Distrital da Figueira da Foz","Figueira da Foz"]
[null,{"$f":"VLOOKUP(B32,B35:C41,2)","v":"Quarta-feira"},"Dia da semana",null,null,null,"Hospital Divino Espírito Santo – Ponta Delgada ","Ponta Delgada"]
[null,{"$f":"VLOOKUP(MONTH(B26),B43:C54,2)","v":"janeiro"},"Mês do ano",null,null,null,"Hospital Espírito Santo Évora","Évora"]
[null,1,"Domingo",null,null,null,"Hospital Garcia de Orta","Alamada"]
[null,2,"Segunda-feira",null,null,null,"Hospital Prof Dr Fernando Fonseca","Lisboa"]
[null,3,"Terça-feira",null,null,null,"ULS da Guarda","Guarda"]
[null,4,"Quarta-feira",null,null,null,"ULS de Castelo Branco","Castelo Branco"]
[null,5,"Quinta-feira",null,null,null,"ULS do Alto Minho","Viana do Castelo"]
[null,6,"Sexta-feira",null,null,null,"ULS do Baixo Alentejo","Beja"]
[null,7,"Sábado",null,null,null,"ULS Matosinhos","Matosinhos"]
[null,null,null,null,null,null,"Outro","<--<--"]
[null,1,"janeiro"]
[null,2,"fevereiro"]
[null,3,"março"]
[null,4,"abril"]
[null,5,"maio"]
[null,6,"junho"]
[null,7,"julho"]
[null,8,"agosto"]
[null,9,"setembro"]
[null,10,"outubro"]
[null,11,"novembro"]
[null,12,"dezembro"]
[]
[]
[]
[]
[]
[]
[]
[]
[]
[]
[]
[]
[]
[]
[]
[]
[]
[]
[]
[]
[]
[]
[]
[]
[]
[]
[]
[]
[]
[]
[]
[]
[]
[]
[]
[]
[]
[]
[]
[]
[]
[]
[]
[]
[]
[]
[]
[]
[]
[]
[]
[]
[]
[]
[]
[]
[]
[]
[]
[]
[]
[]
[]
[]
[]
[]
[]
[]
[]
[]
[]
[]
[]
[]
[]
[]
[]
[]
[]
[]
[]
[]
[]
[]
[]
[]
[]
[]
[]
[]
[]
[]
[]
[]
[]
[]
[]
[]
[]
[]
[]
[]
[]
[]
[]
[]
[]
[]
[]
[]
[]
[]
[]
[]
[]
[]
[]
[]
[]
[]
[]
[]
[]
[]
[]
[]
[]
[]
[]
[]
[]
[]
[]
[]
[]
[]
[]
[]
[]
[]
[]
[]
[]
[]
[]
[]
{"$rows_left_out":69}